BDBM49091 2-[[2-[[4-allyl-5-(2-amino-4-methyl-thiazol-5-yl)-1,2,4-triazol-3-yl]thio]acetyl]amino]-4,5-dimethyl-thiophene-3-carboxylic acid ethyl ester::2-[[2-[[5-(2-amino-4-methyl-5-thiazolyl)-4-prop-2-enyl-1,2,4-triazol-3-yl]thio]-1-oxoethyl]amino]-4,5-dimethyl-3-thiophenecarboxylic acid ethyl ester::MLS000096986::SMR000074808::cid_2947800::ethyl 2-[({[4-allyl-5-(2-amino-4-methyl-1,3-thiazol-5-yl)-4H-1,2,4-triazol-3-yl]thio}acetyl)amino]-4,5-dimethyl-3-thiophenecarboxylate::ethyl 2-[2-[[5-(2-azanyl-4-methyl-1,3-thiazol-5-yl)-4-prop-2-enyl-1,2,4-triazol-3-yl]sulfanyl]ethanoylamino]-4,5-dimethyl-thiophene-3-carboxylate::ethyl 2-[[2-[[5-(2-amino-4-methyl-1,3-thiazol-5-yl)-4-prop-2-enyl-1,2,4-triazol-3-yl]sulfanyl]acetyl]amino]-4,5-dimethylthiophene-3-carboxylate
SMILES CCOC(=O)c1c(C)c(C)sc1NC(=O)CSc1nnc(-c2sc(N)nc2C)n1CC=C
InChI Key InChIKey=GLIOLZVNDBEIDK-UHFFFAOYSA-N
Data  1 EC50
  Tab Delimited (TSV)   2D SDfile   Computed 3D by Vconf -m prep SDfile
Find this compound or compounds like it in BindingDB:
Activity Spreadsheet -- Enzyme Inhibition Constant Data from BindingDB
Found 1 hit for monomerid = 49091
TargetD(1A) dopamine receptor(Homo sapiens (Human))
Vanderbilt Screening Center For Gpcrs, Ion Channels And Transporters
Curated by PubChem BioAssay
LigandPNGBDBM49091(2-[[2-[[4-allyl-5-(2-amino-4-methyl-thiazol-5-yl)-...)
Affinity DataEC50:  0.0285nM. Assay description: Assay Provider: Val Watts Assay Provider Affiliation: Purdue University Grant Title: Allosteric Modulators of D1 Receptors Grant Number: 1 X01 MH0776...
In DepthDetails PCBioAssay