BDBM49147 5-Hydroxy-3-phenoxy-anthra[1,9-cd]isoxazol-6-one::MLS000026866::SMR000122869::cid_2246180
SMILES Oc1cc(Oc2ccccc2)c2noc3-c4ccccc4C(=O)c1c23
InChI Key InChIKey=VFFLRXLCOBABIU-UHFFFAOYSA-N
Data  1 IC50
  Tab Delimited (TSV)   2D SDfile   Computed 3D by Vconf -m prep SDfile
Find this compound or compounds like it in BindingDB:
Activity Spreadsheet -- Enzyme Inhibition Constant Data from BindingDB
Found 1 hit for monomerid = 49147
TargetEstrogen receptor beta(Homo sapiens (Human))
Emory University
Curated by PubChem BioAssay
LigandPNGBDBM49147(5-Hydroxy-3-phenoxy-anthra[1,9-cd]isoxazol-6-one |...)
Affinity DataIC50:  3.70E+4nM. Assay description: NIH Molecular Libraries Screening Centers Network [MLSCN] Emory Chemical Biology Discovery Center in MLSCN Assay provider: John A. Katzenellenbogen, ...
In DepthDetails PCBioAssay