BDBM49205 2-(2,3-dihydroindol-1-yl)-7,8-dihydro-6H-quinazolin-5-one::2-indolin-1-yl-7,8-dihydro-6H-quinazolin-5-one::MLS000041458::SMR000044336::cid_663648
SMILES O=C1CCCc2nc(ncc12)N1CCc2ccccc12
InChI Key InChIKey=BNZBFVGKGGBLAA-UHFFFAOYSA-N
Data  2 EC50
  Tab Delimited (TSV)   2D SDfile   Computed 3D by Vconf -m prep SDfile
Find this compound or compounds like it in BindingDB:
Activity Spreadsheet -- Enzyme Inhibition Constant Data from BindingDB
Found 2 hits for monomerid = 49205
TargetTumor necrosis factor receptor superfamily member 10B(Homo sapiens (Human))
Burnham Center For Chemical Genomics
Curated by PubChem BioAssay
LigandPNGBDBM49205(2-(2,3-dihydroindol-1-yl)-7,8-dihydro-6H-quinazoli...)
Affinity DataEC50: >1.25E+4nM
In DepthDetails PCBioAssay
TargetTranscription factor p65(Homo sapiens (Human))
Srmlsc
Curated by PubChem BioAssay
LigandPNGBDBM49205(2-(2,3-dihydroindol-1-yl)-7,8-dihydro-6H-quinazoli...)
Affinity DataEC50:  8.47E+4nM. Assay description: Southern Research Molecular Libraries Screening Center (SRMLSC) Southern Research Institute (Birmingham, Alabama) NIH Molecular Libraries Screening C...
In DepthDetails PCBioAssay