BDBM49280 MLS000099174::N-[4-(2-methyl-1,3-thiazol-4-yl)phenyl]-2-thiophenecarboxamide::N-[4-(2-methyl-1,3-thiazol-4-yl)phenyl]thiophene-2-carboxamide::N-[4-(2-methyl-4-thiazolyl)phenyl]-2-thiophenecarboxamide::N-[4-(2-methylthiazol-4-yl)phenyl]thiophene-2-carboxamide::SMR000070894::cid_732488
SMILES Cc1nc(cs1)-c1ccc(NC(=O)c2cccs2)cc1
InChI Key InChIKey=FTSCAFCBIYERSG-UHFFFAOYSA-N
Data  1 EC50
  Tab Delimited (TSV)   2D SDfile   Computed 3D by Vconf -m prep SDfile
Find this compound or compounds like it in BindingDB:
Activity Spreadsheet -- Enzyme Inhibition Constant Data from BindingDB
Found 1 hit for monomerid = 49280
TargetTranscription factor p65(Homo sapiens (Human))
Srmlsc
Curated by PubChem BioAssay
LigandPNGBDBM49280(MLS000099174 | N-[4-(2-methyl-1,3-thiazol-4-yl)phe...)
Affinity DataEC50:  2.11E+3nM. Assay description: Southern Research Molecular Libraries Screening Center (SRMLSC) Southern Research Institute (Birmingham, Alabama) NIH Molecular Libraries Screening C...
In DepthDetails PCBioAssay