BDBM4972 (2R,3R,4S)-4-amino-3-acetamido-2-{[2-(3-phenylphenyl)ethyl](propyl)carbamoyl}-3,4-dihydro-2H-pyran-6-carboxylic acid::carboxamide deriv. 4ao
SMILES [H][C@]1(OC(=C[C@H](N)[C@H]1NC(C)=O)C(O)=O)C(=O)N(CCC)CCc1cccc(c1)-c1ccccc1
InChI Key InChIKey=GOWBQXLGPORSCM-QPTUXGOLSA-N
Data  2 IC50
  Tab Delimited (TSV)   2D SDfile   Computed 3D by Vconf -m prep SDfile
Find this compound or compounds like it in BindingDB:
Activity Spreadsheet -- Enzyme Inhibition Constant Data from BindingDB
Found 2 hits for monomerid = 4972
TargetNeuraminidase(Influenza B virus)
Glaxo Wellcome Research And Development
LigandPNGBDBM4972((2R,3R,4S)-4-amino-3-acetamido-2-{[2-(3-phenylphen...)
Affinity DataIC50:  4.50E+3nM. Assay description: A standard fluorimetric assay was used to measure influenza virus neuraminidase activity. The substrate 2 -(4-methylumbelliferyl)-alpha-D-acetylneura...
In DepthDetails ArticlePubMed
TargetNeuraminidase(Influenza A virus (A/Singapore/1/57(H2N2)))
Glaxo Wellcome Research And Development
LigandPNGBDBM4972((2R,3R,4S)-4-amino-3-acetamido-2-{[2-(3-phenylphen...)
Affinity DataIC50:  2nM. Assay description: A standard fluorimetric assay was used to measure influenza virus neuraminidase activity. The substrate 2 -(4-methylumbelliferyl)-alpha-D-acetylneura...
In DepthDetails ArticlePubMed