BDBM49784 3-(1,3-benzothiazol-2-yl)-1,1-dimethyl-thiourea::3-(1,3-benzothiazol-2-yl)-1,1-dimethylthiourea::MLS000664888::N'-1,3-benzothiazol-2-yl-N,N-dimethylthiourea::SMR000294835::cid_946666
SMILES CN(C)C(=S)Nc1nc2ccccc2s1
InChI Key InChIKey=SHKIAKVYCNVNHP-UHFFFAOYSA-N
Data  1 IC50  1 EC50
  Tab Delimited (TSV)   2D SDfile   Computed 3D by Vconf -m prep SDfile
Find this compound or compounds like it in BindingDB:
Activity Spreadsheet -- Enzyme Inhibition Constant Data from BindingDB
Found 2 hits for monomerid = 49784
TargetMannose-6-phosphate isomerase(Homo sapiens (Human))
Sanford-Burnham Center For Chemical Genomics
Curated by PubChem BioAssay
LigandPNGBDBM49784(3-(1,3-benzothiazol-2-yl)-1,1-dimethyl-thiourea | ...)
Affinity DataIC50:  3.79E+3nM. Assay description: Data Source: Sanford-Burnham Center for Chemical Genomics (SBCCG) Source Affiliation: Sanford-Burnham Medical Research Institute (SBMRI, San Diego, C...
In DepthDetails PCBioAssay
TargetTranscription factor p65(Homo sapiens (Human))
Srmlsc
Curated by PubChem BioAssay
LigandPNGBDBM49784(3-(1,3-benzothiazol-2-yl)-1,1-dimethyl-thiourea | ...)
Affinity DataEC50:  1.51E+4nM. Assay description: Southern Research Molecular Libraries Screening Center (SRMLSC) Southern Research Institute (Birmingham, Alabama) NIH Molecular Libraries Screening C...
In DepthDetails PCBioAssay