BDBM49791 (E)-3-(3,4-dimethylanilino)-1-(2-thienyl)prop-2-en-1-one::(E)-3-(3,4-dimethylanilino)-1-thiophen-2-yl-2-propen-1-one::(E)-3-(3,4-dimethylanilino)-1-thiophen-2-ylprop-2-en-1-one::(E)-3-[(3,4-dimethylphenyl)amino]-1-thiophen-2-yl-prop-2-en-1-one::3-[(3,4-dimethylphenyl)amino]-1-(2-thienyl)-2-propen-1-one::MLS000625202::SMR000293994::cid_2205176
SMILES Cc1ccc(cc1C)N=CCC(=O)c1cccs1
InChI Key InChIKey=PRKYZLCHKBDJKO-UHFFFAOYSA-N
Data  1 EC50
  Tab Delimited (TSV)   2D SDfile   Computed 3D by Vconf -m prep SDfile
Find this compound or compounds like it in BindingDB:
Activity Spreadsheet -- Enzyme Inhibition Constant Data from BindingDB
Found 1 hit for monomerid = 49791
TargetTranscription factor p65(Homo sapiens (Human))
Srmlsc
Curated by PubChem BioAssay
LigandPNGBDBM49791((E)-3-(3,4-dimethylanilino)-1-(2-thienyl)prop-2-en...)
Affinity DataEC50:  270nM. Assay description: Southern Research Molecular Libraries Screening Center (SRMLSC) Southern Research Institute (Birmingham, Alabama) NIH Molecular Libraries Screening C...
In DepthDetails PCBioAssay