BDBM4988 (3R,4R,5S)-4-Acetamido-5-amino-3-(octyloxy)-1-cyclohexene-1-carboxylic Acid::(3R,4R,5S)-5-amino-4-acetamido-3-(octyloxy)cyclohex-1-ene-1-carboxylic acid::Carbocyclic Analogue 39
SMILES CCCCCCCCO[C@@H]1C=C(C[C@H](N)[C@H]1NC(C)=O)C(O)=O
InChI Key InChIKey=QPGLIZFPRZQICS-ARFHVFGLSA-N
Data  2 IC50
  Tab Delimited (TSV)   2D SDfile   Computed 3D by Vconf -m prep SDfile
Find this compound or compounds like it in BindingDB:
Activity Spreadsheet -- Enzyme Inhibition Constant Data from BindingDB
Found 2 hits for monomerid = 4988
TargetNeuraminidase(Influenza B virus (B/Lee/40))
Gilead Sciences
LigandPNGBDBM4988((3R,4R,5S)-4-Acetamido-5-amino-3-(octyloxy)-1-cycl...)
Affinity DataIC50:  3.50E+3nMpH: 6.5 T: 2°C. Assay description: A standard fluorimetric assay was used to measure influenza virus neuraminidase activity. The substrate 2 -(4-methylumbelliferyl)-alpha-D-acetylneura...
In DepthDetails ArticlePubMed
TargetNeuraminidase(Influenza A virus (A/Puerto Rico/8/34/Mount Sinai(...)
Gilead Sciences
LigandPNGBDBM4988((3R,4R,5S)-4-Acetamido-5-amino-3-(octyloxy)-1-cycl...)
Affinity DataIC50:  180nMpH: 6.5 T: 2°C. Assay description: A standard fluorimetric assay was used to measure influenza virus neuraminidase activity. The substrate 2 -(4-methylumbelliferyl)-alpha-D-acetylneura...
In DepthDetails ArticlePubMed