BDBM50000006 CHEMBL2370809::[Ac-(D)Nal-(D)Cpa-(D)Pal-Ser-Lys(Nic)-(D)Lys(Nic)-Leu-ILys-Pro-(D)Ala-NH2]GnRH
SMILES CC(C)C[C@H](NC(=O)[C@H](CCCCNC(=O)c1cccnc1)NC(=O)[C@H](CCCCNC(=O)c1cccnc1)NC(=O)[C@H](CO)NC(=O)[C@@H](Cc1cccnc1)NC(=O)[C@H](Cc1ccc(Cl)cc1)NC(=O)[C@@H](Cc1ccc2ccccc2c1)NC(C)=O)C(=O)N[C@@H](CCCCNC(C)C)C(=O)N1CCC[C@@H]1C(=O)N[C@@H](C)C(N)=O
InChI Key InChIKey=QRYFGTULTGLGHU-ZLJFCPNZSA-N
Data  1 Kd
  Tab Delimited (TSV)   2D SDfile   Computed 3D by Vconf -m prep SDfile
Find this compound or compounds like it in BindingDB:
Activity Spreadsheet -- Enzyme Inhibition Constant Data from BindingDB
Found 1 hit for monomerid = 50000006
TargetGonadotropin-releasing hormone receptor(Homo sapiens (Human))
Salk Institute
Curated by ChEMBL
LigandPNGBDBM50000006(CHEMBL2370809 | [Ac-(D)Nal-(D)Cpa-(D)Pal-Ser-Lys(N...)
Affinity DataKd:  0.350nM. Assay description: The binding affinity towards Gonadotropin-releasing hormone receptor
In DepthDetails ArticlePubMed