BDBM50000079 CHEMBL142755::[2-(3,4-Dichloro-phenyl)-ethyl]-(2-pyrrolidin-1-yl-ethyl)-amine
SMILES Clc1ccc(CCNCCN2CCCC2)cc1Cl
InChI Key InChIKey=KFLJZQLENAVFAL-UHFFFAOYSA-N
Data  1 KI
  Tab Delimited (TSV)   2D SDfile   Computed 3D by Vconf -m prep SDfile
Find this compound or compounds like it in BindingDB:
Activity Spreadsheet -- Enzyme Inhibition Constant Data from BindingDB
Found 1 hit for monomerid = 50000079
TargetSigma non-opioid intracellular receptor 1(Homo sapiens (Human))
National Institute Of Diabetes And Digestive And Kidney Diseases
Curated by ChEMBL
LigandPNGBDBM50000079(CHEMBL142755 | [2-(3,4-Dichloro-phenyl)-ethyl]-(2-...)
Affinity DataKi:  1.10nM. Assay description: Displacement of [3H]-(+) -3PPP from sigma receptor in guinea pig brain membranes
In DepthDetails ArticlePubMed