BDBM50000262 1-[2-(3,4-Dichloro-phenyl)-acetyl]-2-pyrrolidin-1-ylmethyl-piperidine-4-carboxylic acid amide::CHEMBL146140
SMILES NC(=O)[C@@H]1CCN([C@H](CN2CCCC2)C1)C(=O)Cc1ccc(Cl)c(Cl)c1
InChI Key InChIKey=YTCMYWPGDYEQOR-CABCVRRESA-N
Data  1 IC50
  Tab Delimited (TSV)   2D SDfile   Computed 3D by Vconf -m prep SDfile
Find this compound or compounds like it in BindingDB:
Activity Spreadsheet -- Enzyme Inhibition Constant Data from BindingDB
Found 1 hit for monomerid = 50000262
TargetKappa-type opioid receptor(Homo sapiens (Human))
Glaxo Group Research
Curated by ChEMBL
LigandPNGBDBM50000262(1-[2-(3,4-Dichloro-phenyl)-acetyl]-2-pyrrolidin-1-...)
Affinity DataIC50:  1.20E+3nM. Assay description: Opioid receptor kappa 1 agonist potency was determined in vitro using rabbit vas deferens (LVD) preparation
In DepthDetails ArticlePubMed