BDBM50000410 5-(2-Benzenesulfonylamino-2-oxo-ethyl)-pyridine-2-carboxylic acid::CHEMBL354853
SMILES OC(=O)c1ccc(CC(=O)NS(=O)(=O)c2ccccc2)cn1
InChI Key InChIKey=HQHVQNBQIHCMFV-UHFFFAOYSA-N
Data  1 IC50
  Tab Delimited (TSV)   2D SDfile   Computed 3D by Vconf -m prep SDfile
Find this compound or compounds like it in BindingDB:
Activity Spreadsheet -- Enzyme Inhibition Constant Data from BindingDB
Found 1 hit for monomerid = 50000410
TargetTransmembrane prolyl 4-hydroxylase(Homo sapiens (Human))
Ici Pharmaceuticals Group
Curated by ChEMBL
LigandPNGBDBM50000410(5-(2-Benzenesulfonylamino-2-oxo-ethyl)-pyridine-2-...)
Affinity DataIC50:  1.70E+4nM. Assay description: Inhibition of prolyl 4-hydroxylase
In DepthDetails ArticlePubMed