BDBM50001143 CHEMBL3236419
SMILES CC(=O)NP(S)(=O)OC[C@H]1O[C@@H](n2ccc(N)nc2=O)C(F)(F)[C@@H]1O
InChI Key InChIKey=HEOVRPBHXWKFSZ-PBBASEOCSA-N
Data  1 EC50
  Tab Delimited (TSV)   2D SDfile   Computed 3D by Vconf -m prep SDfile
Find this compound or compounds like it in BindingDB:
Activity Spreadsheet -- Enzyme Inhibition Constant Data from BindingDB
Found 1 hit for monomerid = 50001143
TargetDNA polymerase alpha catalytic subunit(Homo sapiens (Human))
Polish Academy Of Sciences
Curated by ChEMBL
LigandPNGBDBM50001143(CHEMBL3236419)
Affinity DataEC50: >5.00E+5nM. Assay description: Inhibition of human DNA polymerase alpha using dCTP as substrate assessed as single base extension reaction after 2 hrs
In DepthDetails ArticlePubMed