BDBM50001175 C-(Benzothiazol-2-ylsulfanyl)-methylamine-N-hydroxy-N-methyl-carboxamide::CHEMBL110513
SMILES CN(O)C(=O)NCSc1nc2ccccc2s1
InChI Key InChIKey=LBOOLBFFAHHFCJ-UHFFFAOYSA-N
Data  1 EC50
  Tab Delimited (TSV)   2D SDfile   Computed 3D by Vconf -m prep SDfile
Find this compound or compounds like it in BindingDB:
Activity Spreadsheet -- Enzyme Inhibition Constant Data from BindingDB
Found 1 hit for monomerid = 50001175
TargetPolyunsaturated fatty acid 5-lipoxygenase(Homo sapiens (Human))
R. W. Johnson Pharmaceutical Research Institute
Curated by ChEMBL
LigandPNGBDBM50001175(C-(Benzothiazol-2-ylsulfanyl)-methylamine-N-hydrox...)
Affinity DataEC50:  1.07E+3nM. Assay description: In vitro inhibition of ionophore stimulated LTB4 release from human peripheral blood leukocytes.
In DepthDetails ArticlePubMed