BDBM50001207 CHEMBL3236423
SMILES Nc1ccn([C@@H]2O[C@H](COP(O)(=O)NC(=O)c3ccncc3)[C@@H](O)C2(F)F)c(=O)n1
InChI Key InChIKey=DRUIJEZGLYVKIN-IRUJWGPZSA-N
Data  1 EC50
  Tab Delimited (TSV)   2D SDfile   Computed 3D by Vconf -m prep SDfile
Find this compound or compounds like it in BindingDB:
Activity Spreadsheet -- Enzyme Inhibition Constant Data from BindingDB
Found 1 hit for monomerid = 50001207
TargetDNA polymerase alpha catalytic subunit(Homo sapiens (Human))
Polish Academy Of Sciences
Curated by ChEMBL
LigandPNGBDBM50001207(CHEMBL3236423)
Affinity DataEC50: >5.00E+5nM. Assay description: Inhibition of human DNA polymerase alpha using dCTP as substrate assessed as single base extension reaction after 2 hrs
In DepthDetails ArticlePubMed