BDBM50001246 CHEMBL543879::[3-(1-Methyl-1H-tetrazol-5-yl)-quinolin-4-yl]-o-tolyl-amine; hydrochloride (0.2Ethanol)
SMILES Cc1ccccc1Nc1c(cnc2ccccc12)-c1nnnn1C
InChI Key InChIKey=BWFYRWJBXJOHLE-UHFFFAOYSA-N
Data  1 IC50
  Tab Delimited (TSV)   2D SDfile   Computed 3D by Vconf -m prep SDfile
Find this compound or compounds like it in BindingDB:
Activity Spreadsheet -- Enzyme Inhibition Constant Data from BindingDB
Found 1 hit for monomerid = 50001246
TargetPotassium-transporting ATPase alpha chain 1/subunit beta(Sus scrofa (Pig))
Smithkline Beecham Pharmaceuticals R&D
Curated by ChEMBL
LigandPNGBDBM50001246(CHEMBL543879 | [3-(1-Methyl-1H-tetrazol-5-yl)-quin...)
Affinity DataIC50:  1.20E+4nM. Assay description: Concentration required to inhibit the activity of K+ stimulated gastric ATPase
In DepthDetails ArticlePubMed