BDBM50001353 2-cyclooctyl-1-spiro[1H-indene-1,4'-(hexahydropyridine)]-1-yl-1-ethanone::CHEMBL341021
SMILES O=C(CC1CCCCCCC1)N1CCC2(CC1)C=Cc1ccccc21
InChI Key InChIKey=SKYLOCVKTGZMKA-UHFFFAOYSA-N
Data  3 IC50
  Tab Delimited (TSV)   2D SDfile   Computed 3D by Vconf -m prep SDfile
Find this compound or compounds like it in BindingDB:
Activity Spreadsheet -- Enzyme Inhibition Constant Data from BindingDB
Found 3 hits for monomerid = 50001353
TargetOxytocin receptor(RAT)
Merck Research Laboratories
Curated by ChEMBL
LigandPNGBDBM50001353(2-cyclooctyl-1-spiro[1H-indene-1,4'-(hexahydropyri...)
Affinity DataIC50:  2.20E+4nM. Assay description: Half-maximal inhibition of binding of [3H]-Oxytocin to OT receptor in rat uterine tissue
In DepthDetails ArticlePubMed
TargetVasopressin V1a/V1b/V2 receptor(RAT)
Merck Research Laboratories
Curated by ChEMBL
LigandPNGBDBM50001353(2-cyclooctyl-1-spiro[1H-indene-1,4'-(hexahydropyri...)
Affinity DataIC50: >1.00E+4nM. Assay description: Half-maximal inhibition of binding of [3H]vasopressin to vasopressin receptor 1 in rat liver
In DepthDetails ArticlePubMed
TargetVasopressin V1a/V1b/V2 receptor(RAT)
Merck Research Laboratories
Curated by ChEMBL
LigandPNGBDBM50001353(2-cyclooctyl-1-spiro[1H-indene-1,4'-(hexahydropyri...)
Affinity DataIC50: >1.00E+4nM. Assay description: Half-maximal inhibition of binding of [3H]- vasopressin to the vasopressin receptor 2 in rat kidney
In DepthDetails ArticlePubMed