BDBM50001420 1'-(4-nitrophenylsulfonyl)spiro[1H-indene-1,4'-(hexahydropyridine)]::CHEMBL126453
SMILES [O-][N+](=O)c1ccc(cc1)S(=O)(=O)N1CCC2(CC1)C=Cc1ccccc21
InChI Key InChIKey=IOGOZNMOINHXJL-UHFFFAOYSA-N
Data  1 IC50
  Tab Delimited (TSV)   2D SDfile   Computed 3D by Vconf -m prep SDfile
Find this compound or compounds like it in BindingDB:
Activity Spreadsheet -- Enzyme Inhibition Constant Data from BindingDB
Found 1 hit for monomerid = 50001420
TargetOxytocin receptor(RAT)
Merck Research Laboratories
Curated by ChEMBL
LigandPNGBDBM50001420(1'-(4-nitrophenylsulfonyl)spiro[1H-indene-1,4'-(he...)
Affinity DataIC50:  1.60E+4nM. Assay description: Half-maximal inhibition of binding of [3H]-Oxytocin to OT receptor in rat uterine tissue
In DepthDetails ArticlePubMed