BDBM50001431 1'-[2-phenyl-(E)-1-ethenylsulfonyl]spiro[1H-indene-1,4'-(hexahydropyridine)]::CHEMBL340383
SMILES O=S(=O)(\C=C\c1ccccc1)N1CCC2(CC1)C=Cc1ccccc21
InChI Key InChIKey=HMQCGMUQHMJYNX-GZTJUZNOSA-N
Data  1 IC50
  Tab Delimited (TSV)   2D SDfile   Computed 3D by Vconf -m prep SDfile
Find this compound or compounds like it in BindingDB:
Activity Spreadsheet -- Enzyme Inhibition Constant Data from BindingDB
Found 1 hit for monomerid = 50001431
TargetOxytocin receptor(RAT)
Merck Research Laboratories
Curated by ChEMBL
LigandPNGBDBM50001431(1'-[2-phenyl-(E)-1-ethenylsulfonyl]spiro[1H-indene...)
Affinity DataIC50:  1.00E+4nM. Assay description: Compound was evaluated for half-maximal inhibition of binding of [3H]-Oxytocin to Oxytocin receptor in rat uterine tissue
In DepthDetails ArticlePubMed