BDBM50001432 1'-(2-naphthylsulfonyl)spiro[1H-indene-1,4'-(hexahydropyridine)]::CHEMBL125406
SMILES O=S(=O)(N1CCC2(CC1)C=Cc1ccccc21)c1ccc2ccccc2c1
InChI Key InChIKey=UATSKMRSHVFSOE-UHFFFAOYSA-N
Data  1 IC50
  Tab Delimited (TSV)   2D SDfile   Computed 3D by Vconf -m prep SDfile
Find this compound or compounds like it in BindingDB:
Activity Spreadsheet -- Enzyme Inhibition Constant Data from BindingDB
Found 1 hit for monomerid = 50001432
TargetOxytocin receptor(RAT)
Merck Research Laboratories
Curated by ChEMBL
LigandPNGBDBM50001432(1'-(2-naphthylsulfonyl)spiro[1H-indene-1,4'-(hexah...)
Affinity DataIC50:  3.00E+3nM. Assay description: Compound was evaluated for half-maximal inhibition of binding of [3H]-Oxytocin to Oxytocin receptor in rat uterine tissue
In DepthDetails ArticlePubMed