BDBM50001441 4-(1-{1-[1-({[1-(1-Carbamoyl-3-methyl-butylcarbamoyl)-3-methyl-butylcarbamoyl]-methyl}-carbamoyl)-2-methyl-propylcarbamoyl]-2-phenyl-ethylcarbamoyl}-2-hydroxy-ethylamino)-butyric acid::CHEMBL340847
SMILES CC(C)C[C@H](NC(=O)[C@H](CC(C)C)NC(=O)CNC(=O)[C@@H](NC(=O)[C@H](Cc1ccccc1)NC(=O)[C@H](CO)NCCCC(O)=O)C(C)C)C(N)=O
InChI Key InChIKey=OKXLCQCBXLVKMG-DJNSEWAMSA-N
Data  1 IC50
  Tab Delimited (TSV)   2D SDfile   Computed 3D by Vconf -m prep SDfile
Find this compound or compounds like it in BindingDB:
Activity Spreadsheet -- Enzyme Inhibition Constant Data from BindingDB
Found 1 hit for monomerid = 50001441
TargetSubstance-K receptor(HAMSTER)
Marion Merrell Dow Research Institute
Curated by ChEMBL
LigandPNGBDBM50001441(4-(1-{1-[1-({[1-(1-Carbamoyl-3-methyl-butylcarbamo...)
Affinity DataIC50:  1.65E+3nM. Assay description: Competitive inhibition of [125I]NKA binding to hamster urinary bladder Tachykinin receptor 2
In DepthDetails ArticlePubMed