BDBM50001622 6-[4-(4-Methoxy-phenyl)-quinolin-2-yloxy]-2,2-dimethyl-hexanoic acid::CHEMBL136805
SMILES COc1ccc(cc1)-c1cc(OCCCCC(C)(C)C(O)=O)nc2ccccc12
InChI Key InChIKey=XKGWKDJMXSSHLI-UHFFFAOYSA-N
Data  2 IC50
  Tab Delimited (TSV)   2D SDfile   Computed 3D by Vconf -m prep SDfile
Find this compound or compounds like it in BindingDB:
Activity Spreadsheet -- Enzyme Inhibition Constant Data from BindingDB
Found 2 hits for monomerid = 50001622
TargetLeukotriene B4 receptor 1(Homo sapiens (Human))
Centre De Recherche De Vitry-Alfortville
Curated by ChEMBL
LigandPNGBDBM50001622(6-[4-(4-Methoxy-phenyl)-quinolin-2-yloxy]-2,2-dime...)
Affinity DataIC50:  140nM. Assay description: Inhibition of [3H]-LTB4 binding to Leukotriene B4 receptor in the guinea pig spleen membranes
In DepthDetails ArticlePubMed
TargetLeukotriene B4 receptor 1(Homo sapiens (Human))
Centre De Recherche De Vitry-Alfortville
Curated by ChEMBL
LigandPNGBDBM50001622(6-[4-(4-Methoxy-phenyl)-quinolin-2-yloxy]-2,2-dime...)
Affinity DataIC50:  10nM. Assay description: Inhibition of [3H]-LTB4 binding to Leukotriene B4 receptor in the guinea pig spleen membranes
In DepthDetails ArticlePubMed