BDBM50001794 1-(2-{4-[1-(4-Fluoro-phenyl)-6-methyl-1H-indol-3-yl]-piperidin-1-yl}-ethyl)-3-isopropyl-imidazolidin-2-one::CHEMBL144325
SMILES CC(C)N1CCN(CCN2CCC(CC2)c2cn(-c3ccc(F)cc3)c3cc(C)ccc23)C1=O
InChI Key InChIKey=KGASELUWIGUZKN-UHFFFAOYSA-N
Data  3 IC50
  Tab Delimited (TSV)   2D SDfile   Computed 3D by Vconf -m prep SDfile
Find this compound or compounds like it in BindingDB:
Activity Spreadsheet -- Enzyme Inhibition Constant Data from BindingDB
Found 3 hits for monomerid = 50001794
TargetD(2) dopamine receptor(Rattus norvegicus (rat))
H. Lundbeck
Curated by ChEMBL
LigandPNGBDBM50001794(1-(2-{4-[1-(4-Fluoro-phenyl)-6-methyl-1H-indol-3-y...)
Affinity DataIC50:  190nM. Assay description: Displacement of [3H]-spiperone from Dopamine receptor D2 from rat striatal membranes
In DepthDetails ArticlePubMed
TargetSerotonin 2 (5-HT2) receptor(RAT)
H. Lundbeck
Curated by ChEMBL
LigandPNGBDBM50001794(1-(2-{4-[1-(4-Fluoro-phenyl)-6-methyl-1H-indol-3-y...)
Affinity DataIC50:  1.60nM. Assay description: Displacement of [3H]ketanserin from 5-hydroxytryptamine 2 receptor from rat cortical membranes.
In DepthDetails ArticlePubMed
TargetAlpha-1A/Alpha-1B/Alpha-1D adrenergic receptor(Rattus norvegicus (rat))
H. Lundbeck
Curated by ChEMBL
LigandPNGBDBM50001794(1-(2-{4-[1-(4-Fluoro-phenyl)-6-methyl-1H-indol-3-y...)
Affinity DataIC50:  85nM. Assay description: Displacement of [3H]prazosin from Alpha-1 adrenergic receptor of whole rat brain membranes
In DepthDetails ArticlePubMed