BDBM50001956 5-Dibutylamino-5,6-dihydro-1H,4H-imidazo[4,5,1-ij]quinolin-2-one::CHEMBL12099
SMILES CCCCN(CCCC)C1Cc2cccc3[nH]c(=O)n(C1)c23
InChI Key InChIKey=DUYZNNNRBLEHMB-UHFFFAOYSA-N
Data  1 KI
  Tab Delimited (TSV)   2D SDfile   Computed 3D by Vconf -m prep SDfile
Find this compound or compounds like it in BindingDB:
Activity Spreadsheet -- Enzyme Inhibition Constant Data from BindingDB
Found 1 hit for monomerid = 50001956
TargetD(2) dopamine receptor(Rattus norvegicus (rat))
Upjohn Laboratories
Curated by ChEMBL
LigandPNGBDBM50001956(5-Dibutylamino-5,6-dihydro-1H,4H-imidazo[4,5,1-ij]...)
Affinity DataKi: >1.00E+4nM. Assay description: Ability to displace [3H]raclopride from dopamine receptor D2 in rat striatal homogenates.
In DepthDetails ArticlePubMed