BDBM50002050 CHEMBL370544
SMILES [H][C@@]12Oc3c4c(CC5N(CC6CC6)CCC14[C@@]5(O)Cc1ccc(nc21)-c1ccccc1)ccc3O
InChI Key InChIKey=PISLVZAGNHHXMO-SXNYVGIYSA-N
Data  3 KI
  Tab Delimited (TSV)   2D SDfile   Computed 3D by Vconf -m prep SDfile
Find this compound or compounds like it in BindingDB:
Activity Spreadsheet -- Enzyme Inhibition Constant Data from BindingDB
Found 3 hits for monomerid = 50002050
TargetDelta-type opioid receptor(Rattus norvegicus (rat))
University Of Medicine & Dentistry Of New Jersey-Robert Wood Johnson Medical School (Umdnj-Rwjms)
Curated by ChEMBL
LigandPNGBDBM50002050(CHEMBL370544)
Affinity DataKi:  1.80nM. Assay description: Binding affinity against Opioid receptor delta 1 from rat brain membranes using [3H]DADLEChecked by Author
In DepthDetails ArticlePubMed
TargetMu-type opioid receptor(Rattus norvegicus (rat))
University Of Medicine & Dentistry Of New Jersey-Robert Wood Johnson Medical School (Umdnj-Rwjms)
Curated by ChEMBL
LigandPNGBDBM50002050(CHEMBL370544)
Affinity DataKi:  11nM. Assay description: Binding affinity against Opioid receptor mu 1 from rat brain membranes using [3H]DAMGOChecked by Author
In DepthDetails ArticlePubMed
TargetKappa-type opioid receptor(Cavia porcellus (domestic guinea pig))
University Of Medicine & Dentistry Of New Jersey-Robert Wood Johnson Medical School (Umdnj-Rwjms)
Curated by ChEMBL
LigandPNGBDBM50002050(CHEMBL370544)
Affinity DataKi:  18nM. Assay description: Binding affinity against Opioid receptor kappa 1 from guinea pig brain membranes using [3H]U-69593Checked by Author
In DepthDetails ArticlePubMed