BDBM50002093 CHEMBL65699::[11-(3-Dimethylamino-propylidene)-6,11-dihydro-dibenzo[b,e]oxepin-2-yl]-acetic acid
SMILES CN(C)CC\C=C1/c2ccccc2COc2ccc(CC(O)=O)cc12
InChI Key InChIKey=JBIMVDZLSHOPLA-QGMBQPNBSA-N
Data  1 KI
  Tab Delimited (TSV)   2D SDfile   Computed 3D by Vconf -m prep SDfile
Find this compound or compounds like it in BindingDB:
Activity Spreadsheet -- Enzyme Inhibition Constant Data from BindingDB
Found 1 hit for monomerid = 50002093
TargetHistamine H1 receptor(Cavia porcellus (domestic guinea pig))
Kyowa Hakko Kogyo
Curated by ChEMBL
LigandPNGBDBM50002093(CHEMBL65699 | [11-(3-Dimethylamino-propylidene)-6,...)
Affinity DataKi:  5.20nM. Assay description: Binding affinity for histamine H1 receptor from guinea pig cerebellum, using [3H]pyrilamine as radioligand at 0.1 uM
In DepthDetails ArticlePubMed