BDBM50002152 6-Methyl-8-piperazin-1-yl-imidazo[1,2-a]pyrazine; 2M.hydrochloride::CHEMBL545289
SMILES Cc1cn2ccnc2c(n1)N1CCNCC1
InChI Key InChIKey=IRBSSAXKBQBWNC-UHFFFAOYSA-N
Data  3 KI
  Tab Delimited (TSV)   2D SDfile   Computed 3D by Vconf -m prep SDfile
Find this compound or compounds like it in BindingDB:
Activity Spreadsheet -- Enzyme Inhibition Constant Data from BindingDB
Found 3 hits for monomerid = 50002152
TargetAlpha-2A adrenergic receptor(BOVINE)
Merck Sharp And Dohme Research Laboratories
Curated by ChEMBL
LigandPNGBDBM50002152(6-Methyl-8-piperazin-1-yl-imidazo[1,2-a]pyrazine; ...)
Affinity DataKi:  190nM. Assay description: Binding affinity at Alpha-2 adrenergic receptor in calf cerebral cortex homogenates by [3H]clonidine displacement.
In DepthDetails ArticlePubMed
TargetBeta-1 adrenergic receptor(GUINEA PIG)
Merck Sharp And Dohme Research Laboratories
Curated by ChEMBL
LigandPNGBDBM50002152(6-Methyl-8-piperazin-1-yl-imidazo[1,2-a]pyrazine; ...)
Affinity DataKi:  220nM. Assay description: Binding affinity at Beta-1 adrenergic receptor in guinea pigs by [125I]CYP displacement
In DepthDetails ArticlePubMed
TargetBeta-2 adrenergic receptor(GUINEA PIG)
Merck Sharp And Dohme Research Laboratories
Curated by ChEMBL
LigandPNGBDBM50002152(6-Methyl-8-piperazin-1-yl-imidazo[1,2-a]pyrazine; ...)
Affinity DataKi:  280nM. Assay description: Binding affinity against Beta-2 adrenergic receptor was measured using [125I]CYP as radioligand
In DepthDetails ArticlePubMed