BDBM50002319 1-(4-Fluoro-phenyl)-4-[4-(5-fluoro-pyrimidin-2-yl)-piperazin-1-yl]-butylamine::CHEMBL137967
SMILES NC(CCCN1CCN(CC1)c1ncc(F)cn1)c1ccc(F)cc1
InChI Key InChIKey=YTEBHKVWLVDMRI-UHFFFAOYSA-N
Data  2 IC50
  Tab Delimited (TSV)   2D SDfile   Computed 3D by Vconf -m prep SDfile
Find this compound or compounds like it in BindingDB:
Activity Spreadsheet -- Enzyme Inhibition Constant Data from BindingDB
Found 2 hits for monomerid = 50002319
TargetAlpha-1A/Alpha-1B/Alpha-1D adrenergic receptor(Rattus norvegicus (rat))
Bristol-Myers Squibb
Curated by ChEMBL
LigandPNGBDBM50002319(1-(4-Fluoro-phenyl)-4-[4-(5-fluoro-pyrimidin-2-yl)...)
Affinity DataIC50:  446nM. Assay description: Inhibition of [3H]WB-4101 binding to rat cortical Alpha-1 adrenergic receptor in vitro
In DepthDetails ArticlePubMed
TargetD(2) dopamine receptor(Rattus norvegicus (rat))
Bristol-Myers Squibb
Curated by ChEMBL
LigandPNGBDBM50002319(1-(4-Fluoro-phenyl)-4-[4-(5-fluoro-pyrimidin-2-yl)...)
Affinity DataIC50: >1.00E+3nM. Assay description: In vitro inhibitory against radioligand [3H]spiperone binding to rat striatal Dopamine receptor D2
In DepthDetails ArticlePubMed