BDBM50002414 CHEMBL194432
SMILES CC(C)C[C@H]1N([C@@H](C(=O)NC(C)C)c2ccccc2)C(=O)[C@@H](C2Cc3ccccc3C2)N(CC=C)C1=O
InChI Key InChIKey=BCIHGEOQOWIYMY-JCYYIGJDSA-N
Data  1 KI
  Tab Delimited (TSV)   2D SDfile   Computed 3D by Vconf -m prep SDfile
Find this compound or compounds like it in BindingDB:
Activity Spreadsheet -- Enzyme Inhibition Constant Data from BindingDB
Found 1 hit for monomerid = 50002414
TargetOxytocin receptor(Homo sapiens (Human))
Glaxosmithkline
Curated by ChEMBL
LigandPNGBDBM50002414(CHEMBL194432)
Affinity DataKi:  63nM. Assay description: Displacement of [3H]oxytocin from human Oxytocin receptorChecked by Author
In DepthDetails ArticlePubMed