BDBM50002884 CHEMBL269790
SMILES CC(C)CCN1c2ccccc2C(=NN(CC(=O)Nc2cccc(c2)C(O)=O)C1=O)C1CCCCC1
InChI Key InChIKey=BYGRIQRULBMRSE-UHFFFAOYSA-N
Data  2 KI
  Tab Delimited (TSV)   2D SDfile   Computed 3D by Vconf -m prep SDfile
Find this compound or compounds like it in BindingDB:
Activity Spreadsheet -- Enzyme Inhibition Constant Data from BindingDB
Found 2 hits for monomerid = 50002884
TargetGastrin/cholecystokinin type B receptor(Homo sapiens (Human))
James Black Foundation
Curated by ChEMBL
LigandPNGBDBM50002884(CHEMBL269790)
Affinity DataKi:  20nM. Assay description: Displacement of [3H]BH-CCK-8S from human recombinant CCK2 receptor expressed in NIH3T3 cellsChecked by Author
In DepthDetails ArticlePubMed
TargetCholecystokinin receptor type A(Homo sapiens (Human))
James Black Foundation
Curated by ChEMBL
LigandPNGBDBM50002884(CHEMBL269790)
Affinity DataKi: <1.00E+4nM. Assay description: Displacement of [3H]L-364718 from human recombinant CCK1 receptor expressed in PC3 cellsChecked by Author
In DepthDetails ArticlePubMed