BDBM50002897 CHEMBL541904
SMILES Cl.CC(C)(C)C(=O)CN1c2ccccc2C(=NN(CC(=O)Nc2ccc3ncn(CC(O)=O)c3c2)C1=O)C1CCCCC1
InChI Key InChIKey=YDDMBBFQMUHJRV-UHFFFAOYSA-N
Data  2 KI
  Tab Delimited (TSV)   2D SDfile   Computed 3D by Vconf -m prep SDfile
Find this compound or compounds like it in BindingDB:
Activity Spreadsheet -- Enzyme Inhibition Constant Data from BindingDB
Found 2 hits for monomerid = 50002897
TargetGastrin/cholecystokinin type B receptor(Homo sapiens (Human))
James Black Foundation
Curated by ChEMBL
LigandPNGBDBM50002897(CHEMBL541904)
Affinity DataKi:  17nM. Assay description: Displacement of [3H]BH-CCK-8S from human recombinant CCK2 receptor expressed in NIH3T3 cellsChecked by Author
In DepthDetails ArticlePubMed
TargetCholecystokinin receptor type A(Homo sapiens (Human))
James Black Foundation
Curated by ChEMBL
LigandPNGBDBM50002897(CHEMBL541904)
Affinity DataKi: <1.00E+4nM. Assay description: Displacement of [3H]L-364718 from human recombinant CCK1 receptor expressed in CHOK1 cellsChecked by Author
In DepthDetails ArticlePubMed