BDBM50002915 CHEMBL389787
SMILES CN1N=C(C2CCCCC2)c2cc(OCc3ccccc3)c(C)cc2N(c2ccc(NCCc3ncc[nH]3)cc2)C1=O
InChI Key InChIKey=GOMKIQDFMMZDAI-UHFFFAOYSA-N
Data  1 KI
  Tab Delimited (TSV)   2D SDfile   Computed 3D by Vconf -m prep SDfile
Find this compound or compounds like it in BindingDB:
Activity Spreadsheet -- Enzyme Inhibition Constant Data from BindingDB
Found 1 hit for monomerid = 50002915
TargetParathyroid hormone/parathyroid hormone-related peptide receptor(Homo sapiens (Human))
James Black Foundation
Curated by ChEMBL
LigandPNGBDBM50002915(CHEMBL389787)
Affinity DataKi:  1.80nM. Assay description: Displacement of [125I]-[Nle,8,18 Tyr34]-hPTH(1-34) from human recombinant PTH1R expressed in HEK293 cellsChecked by Author
In DepthDetails ArticlePubMed