BDBM50003001 CHEMBL394419
SMILES O=C(NCCCN1CCOCC1)[C@@H](Cc1ccccc1)NC(=O)C1(CCc2ccccc12)NC(=O)c1cc2ccccc2s1
InChI Key InChIKey=GXIZWYDJPVSHBX-ZMLFZXNESA-N
Data  3 KI
  Tab Delimited (TSV)   2D SDfile   Computed 3D by Vconf -m prep SDfile
Find this compound or compounds like it in BindingDB:
Activity Spreadsheet -- Enzyme Inhibition Constant Data from BindingDB
Found 3 hits for monomerid = 50003001
TargetSubstance-K receptor(Homo sapiens (Human))
Menarini Ricerche
Curated by ChEMBL
LigandPNGBDBM50003001(CHEMBL394419)
Affinity DataKi:  2nM. Assay description: Displacement of [125I]NKA from human NK2 expressed in CHO-K1 cellsChecked by Author
In DepthDetails ArticlePubMed
TargetSubstance-K receptor(Homo sapiens (Human))
Menarini Ricerche
Curated by ChEMBL
LigandPNGBDBM50003001(CHEMBL394419)
Affinity DataKi:  2nM. Assay description: Displacement of [125I]NKA from human NK2 expressed in CHO-K1 cellsChecked by Author
In DepthDetails ArticlePubMed
TargetSubstance-K receptor(GUINEA PIG)
Menarini Ricerche
Curated by ChEMBL
LigandPNGBDBM50003001(CHEMBL394419)
Affinity DataKi:  20nM. Assay description: Agonist activity at NK2 receptor in guinea pig smooth muscleChecked by Author
In DepthDetails ArticlePubMed