BDBM50003044 CHEMBL3234225
SMILES COC(=O)C(\CSc1nc2ccccc2o1)=C\c1ccc(OC)cc1
InChI Key InChIKey=UXZYMNCSDRVNKV-SDNWHVSQSA-N
Data  1 IC50
  Tab Delimited (TSV)   2D SDfile   Computed 3D by Vconf -m prep SDfile
Find this compound or compounds like it in BindingDB:
Activity Spreadsheet -- Enzyme Inhibition Constant Data from BindingDB
Found 1 hit for monomerid = 50003044
TargetProstaglandin G/H synthase 2(Homo sapiens (Human))
Csir-Indian Institute Of Chemical Technology
Curated by ChEMBL
LigandPNGBDBM50003044(CHEMBL3234225)
Affinity DataIC50:  4.76E+3nM. Assay description: Inhibition of COX2 (unknown origin) by colorimetric method
In DepthDetails ArticlePubMed