BDBM50003114 2,6-Di-tert-butyl-4-(3-methyl-[1,2,4]oxadiazol-5-yl)-phenol::CHEMBL333579
SMILES Cc1noc(n1)-c1cc(c(O)c(c1)C(C)(C)C)C(C)(C)C
InChI Key InChIKey=QFBBZIDDXZJNBZ-UHFFFAOYSA-N
Data  2 IC50
  Tab Delimited (TSV)   2D SDfile   Computed 3D by Vconf -m prep SDfile
Find this compound or compounds like it in BindingDB:
Activity Spreadsheet -- Enzyme Inhibition Constant Data from BindingDB
Found 2 hits for monomerid = 50003114
TargetProstaglandin G/H synthase 1/2(RAT)
Warner-Lambert
Curated by ChEMBL
LigandPNGBDBM50003114(2,6-Di-tert-butyl-4-(3-methyl-[1,2,4]oxadiazol-5-y...)
Affinity DataIC50:  460nM. Assay description: Evaluated in vitro for its inhibitory activity against Prostaglandin G/H synthase
In DepthDetails ArticlePubMed
TargetPolyunsaturated fatty acid 5-lipoxygenase(Rattus norvegicus)
Warner-Lambert
Curated by ChEMBL
LigandPNGBDBM50003114(2,6-Di-tert-butyl-4-(3-methyl-[1,2,4]oxadiazol-5-y...)
Affinity DataIC50:  3.30E+3nM. Assay description: Evaluated in vitro for its inhibitory activity against 5-lipoxygenase
In DepthDetails ArticlePubMed