BDBM50003285 3-[2-Butyl-3-(2-chloro-benzyl)-3H-imidazol-4-yl]-2-(4-methoxy-thiophen-2-ylmethyl)-acrylic acid::CHEMBL126921
SMILES CCCCc1ncc(\C=C(/Cc2cc(OC)cs2)C(O)=O)n1Cc1ccccc1Cl
InChI Key InChIKey=NRIPYKSKBQDPOW-LICLKQGHSA-N
Data  1 IC50
  Tab Delimited (TSV)   2D SDfile   Computed 3D by Vconf -m prep SDfile
Find this compound or compounds like it in BindingDB:
Activity Spreadsheet -- Enzyme Inhibition Constant Data from BindingDB
Found 1 hit for monomerid = 50003285
TargetType-1 angiotensin II receptor B(RAT)
Smithkline Beecham Pharmaceuticals
Curated by ChEMBL
LigandPNGBDBM50003285(3-[2-Butyl-3-(2-chloro-benzyl)-3H-imidazol-4-yl]-2...)
Affinity DataIC50:  300nM. Assay description: Inhibition of [125I]-Angiotensin II receptor specific binding to rat mesenteric arteries
In DepthDetails ArticlePubMed