BDBM50003286 CHEMBL3234576
SMILES CN1CCN(CC1)c1cc(nc(n1)C(F)(F)F)N1CCC[C@@H]1C(=O)NCCc1ccc(cc1)C#N
InChI Key InChIKey=PIWZTMSNVDVOEQ-LJQANCHMSA-N
Data  2 IC50  2 EC50
  Tab Delimited (TSV)   2D SDfile   Computed 3D by Vconf -m prep SDfile
Find this compound or compounds like it in BindingDB:
Activity Spreadsheet -- Enzyme Inhibition Constant Data from BindingDB
Found 4 hits for monomerid = 50003286
TargetG-protein coupled bile acid receptor 1(Homo sapiens (Human))
Genomics Institute Of The Novartis Research Foundation
Curated by ChEMBL
LigandPNGBDBM50003286(CHEMBL3234576)
Affinity DataEC50:  274nM. Assay description: Agonist activity at human TGR5 expressed in Jurkat cells assessed as intracellular cAMP level after 1 hr by HTRF assay
In DepthDetails ArticlePubMed
TargetTranscriptional regulator ERG(Homo sapiens (Human))
Genomics Institute Of The Novartis Research Foundation
Curated by ChEMBL
LigandPNGBDBM50003286(CHEMBL3234576)
Affinity DataIC50:  5.50E+3nM. Assay description: Inhibition of human ERG by patch clamp method
In DepthDetails ArticlePubMed
TargetCytochrome P450 3A4(Homo sapiens (Human))
Genomics Institute Of The Novartis Research Foundation
Curated by ChEMBL
LigandPNGBDBM50003286(CHEMBL3234576)
Affinity DataIC50:  700nM. Assay description: Inhibition of CYP3A4 (unknown origin)
In DepthDetails ArticlePubMed
TargetG-protein coupled bile acid receptor 1(Mus musculus)
Genomics Institute Of The Novartis Research Foundation
Curated by ChEMBL
LigandPNGBDBM50003286(CHEMBL3234576)
Affinity DataEC50:  160nM. Assay description: Agonist activity at mouse TGR5 expressed in Jurkat cells assessed as intracellular cAMP level after 1 hr by HTRF assay
In DepthDetails ArticlePubMed