BDBM50003309 CHEMBL3234557
SMILES Clc1ccc(CCNC(=O)[C@@H]2CCCN(C2)c2ccncn2)cc1
InChI Key InChIKey=OWBWJJQNKXMLDE-OAHLLOKOSA-N
Data  2 EC50
  Tab Delimited (TSV)   2D SDfile   Computed 3D by Vconf -m prep SDfile
Find this compound or compounds like it in BindingDB:
Activity Spreadsheet -- Enzyme Inhibition Constant Data from BindingDB
Found 2 hits for monomerid = 50003309
TargetG-protein coupled bile acid receptor 1(Homo sapiens (Human))
Genomics Institute Of The Novartis Research Foundation
Curated by ChEMBL
LigandPNGBDBM50003309(CHEMBL3234557)
Affinity DataEC50:  1.37E+4nM. Assay description: Agonist activity at human TGR5 expressed in Jurkat cells assessed as intracellular cAMP level after 1 hr by HTRF assay
In DepthDetails ArticlePubMed
TargetG-protein coupled bile acid receptor 1(Mus musculus)
Genomics Institute Of The Novartis Research Foundation
Curated by ChEMBL
LigandPNGBDBM50003309(CHEMBL3234557)
Affinity DataEC50:  8.17E+3nM. Assay description: Agonist activity at mouse TGR5 expressed in Jurkat cells assessed as intracellular cAMP level after 1 hr by HTRF assay
In DepthDetails ArticlePubMed