BDBM50003411 3-(Biphenyl-4-ylmethyl-hydroxy-amino)-1-cyclopropyl-propenone::CHEMBL131359
SMILES ON(Cc1ccc(cc1)-c1ccccc1)C=CC(=O)C1CC1
InChI Key InChIKey=QYPITKAGOUDGJG-UHFFFAOYSA-N
Data  1 IC50
  Tab Delimited (TSV)   2D SDfile   Computed 3D by Vconf -m prep SDfile
Find this compound or compounds like it in BindingDB:
Activity Spreadsheet -- Enzyme Inhibition Constant Data from BindingDB
Found 1 hit for monomerid = 50003411
TargetPolyunsaturated fatty acid 5-lipoxygenase(Rattus norvegicus)
Dupont Pharmaceuticals
Curated by ChEMBL
LigandPNGBDBM50003411(3-(Biphenyl-4-ylmethyl-hydroxy-amino)-1-cyclopropy...)
Affinity DataIC50:  1.20E+3nM. Assay description: inhibitory activity against 5-lipoxygenase in rat basophilic leukemia cell line.
In DepthDetails ArticlePubMed