BDBM50003527 4-(Cyano-pyridin-3-yl-methyl)-piperazine-1-carboxylic acid 2,2-diphenyl-ethyl ester; dihydrochloride; hydrate::CHEMBL3217088
SMILES Cl.Cl.O=C(OCC(c1ccccc1)c1ccccc1)N1CCN(CC1)C(C#N)c1cccnc1
InChI Key InChIKey=OVZIRBJNNGDJRT-UHFFFAOYSA-N
Data  1 IC50
  Tab Delimited (TSV)   2D SDfile   Computed 3D by Vconf -m prep SDfile
Find this compound or compounds like it in BindingDB:
Activity Spreadsheet -- Enzyme Inhibition Constant Data from BindingDB
Found 1 hit for monomerid = 50003527
TargetPlatelet-activating factor receptor(Cavia porcellus)
J. Uriach & C£A.S.A.
Curated by ChEMBL
LigandPNGBDBM50003527(4-(Cyano-pyridin-3-yl-methyl)-piperazine-1-carboxy...)
Affinity DataIC50:  26nM. Assay description: Concentration tested in vitro to inhibit PAF-induced maximum aggregation (PAF-Antagonistic activity) by 50%.
In DepthDetails ArticlePubMed