BDBM50003598 1-Methyl-4-vinyl-1,2,3,6-tetrahydro-pyridine::CHEMBL340338
SMILES CN1CCC(C=C)=CC1
InChI Key InChIKey=HGWVHVYJNWEYTP-UHFFFAOYSA-N
Data  1 KI
  Tab Delimited (TSV)   2D SDfile   Computed 3D by Vconf -m prep SDfile
Find this compound or compounds like it in BindingDB:
Activity Spreadsheet -- Enzyme Inhibition Constant Data from BindingDB
Found 1 hit for monomerid = 50003598
TargetAmine oxidase [flavin-containing] B(Bos taurus)
Virginia Polytechnic Institute And State University
Curated by ChEMBL
LigandPNGBDBM50003598(1-Methyl-4-vinyl-1,2,3,6-tetrahydro-pyridine | CHE...)
Affinity DataKi:  3.30E+5nM. Assay description: Inhibitory constant of the compound against monoamine Oxidase(MAO-B).
In DepthDetails ArticlePubMed