BDBM50003622 CHEMBL524119
SMILES [Br-].OC(c1ccccc1)(c1ccccc1)C12CC[N+](CCOCc3cccc(Br)c3)(CC1)CC2
InChI Key InChIKey=ZZGRUJIGZVAXHU-UHFFFAOYSA-M
Data  1 IC50
  Tab Delimited (TSV)   2D SDfile   Computed 3D by Vconf -m prep SDfile
Find this compound or compounds like it in BindingDB:
Activity Spreadsheet -- Enzyme Inhibition Constant Data from BindingDB
Found 1 hit for monomerid = 50003622
TargetMuscarinic acetylcholine receptor M3(Homo sapiens (Human))
Glaxosmithkline
Curated by ChEMBL
LigandPNGBDBM50003622(CHEMBL524119)
Affinity DataIC50: <1.00E+4nM. Assay description: Antagonist activity at human cloned muscarinic M3 receptor expressed in CHO cells assessed as inhibition of acetylcholine-induced calcium mobilizatio...
In DepthDetails ArticlePubMed