BDBM50003752 1-[2-(3,4-Dichloro-phenyl)-ethyl]-3-pyrrolidin-1-yl-azepane::CHEMBL136981
SMILES Clc1ccc(CCN2CCCCC(C2)N2CCCC2)cc1Cl
InChI Key InChIKey=OQGQWYZQJYEGSJ-UHFFFAOYSA-N
Data  1 KI
  Tab Delimited (TSV)   2D SDfile   Computed 3D by Vconf -m prep SDfile
Find this compound or compounds like it in BindingDB:
Activity Spreadsheet -- Enzyme Inhibition Constant Data from BindingDB
Found 1 hit for monomerid = 50003752
TargetSigma non-opioid intracellular receptor 1(Homo sapiens (Human))
National Institute Of Diabetes And Digestive And Kidney Diseases
Curated by ChEMBL
LigandPNGBDBM50003752(1-[2-(3,4-Dichloro-phenyl)-ethyl]-3-pyrrolidin-1-y...)
Affinity DataKi:  2.70nM. Assay description: Binding affinity for sigma receptor using [3H]-(+)-pentazocine in guinea pig brain homogenates
In DepthDetails ArticlePubMed