BDBM50003811 2-(3-[1,3]Dioxan-2-yl-propylsulfanyl)-4,5-diphenyl-1H-imidazole::CHEMBL136063
SMILES C(CSc1nc(c([nH]1)-c1ccccc1)-c1ccccc1)CC1OCCCO1
InChI Key InChIKey=BMAHLZSDPCBGIB-UHFFFAOYSA-N
Data  1 IC50
  Tab Delimited (TSV)   2D SDfile   Computed 3D by Vconf -m prep SDfile
Find this compound or compounds like it in BindingDB:
Activity Spreadsheet -- Enzyme Inhibition Constant Data from BindingDB
Found 1 hit for monomerid = 50003811
TargetSterol O-acyltransferase 1(Rattus norvegicus)
Rhone-Poulenc Rorer
Curated by ChEMBL
LigandPNGBDBM50003811(2-(3-[1,3]Dioxan-2-yl-propylsulfanyl)-4,5-diphenyl...)
Affinity DataIC50:  47nM. Assay description: Inhibition of acyl coenzyme A:cholesterol acyltransferase (ACAT) activity in rat liver microsome
In DepthDetails ArticlePubMed