BDBM50004043 3,4-Dihydroxy-5-Nitrobenzaldehyde (Rat)::3,4-Dihydroxy-5-nitro-benzaldehyde::CHEMBL1244
SMILES Oc1cc(C=O)cc(c1O)[N+]([O-])=O
InChI Key InChIKey=BBFJODMCHICIAA-UHFFFAOYSA-N
Data  2 IC50
  Tab Delimited (TSV)   2D SDfile   Computed 3D by Vconf -m prep SDfile
Find this compound or compounds like it in BindingDB:
Activity Spreadsheet -- Enzyme Inhibition Constant Data from BindingDB
Found 2 hits for monomerid = 50004043
TargetCatechol O-methyltransferase(Rattus norvegicus (Rat))
Orion
Curated by ChEMBL
LigandPNGBDBM50004043(3,4-Dihydroxy-5-Nitrobenzaldehyde (Rat) | 3,4-Dihy...)
Affinity DataIC50:  24nM. Assay description: In vitro inhibitory activity against catechol O-methyltransferase of rat brain using 3,4-dihydroxybenzoic acid as the substrate.
In DepthDetails ArticlePubMed
TargetCatechol O-methyltransferase(Sus scrofa)
Instituto De QuíMica OrgáNica General (Csic)
Curated by ChEMBL
LigandPNGBDBM50004043(3,4-Dihydroxy-5-Nitrobenzaldehyde (Rat) | 3,4-Dihy...)
Affinity DataIC50:  2.00E+3nM. Assay description: In vitro inhibition of Catechol-O-methyltransferase (COMT) from isolated partially purified pig liver enzyme
In DepthDetails ArticlePubMed