BDBM50004170 Benzoic acid 2-(2-chloro-vinyl)-8-methyl-8-aza-bicyclo[3.2.1]oct-3-yl ester::CHEMBL145589
SMILES CN1[C@@H]2CCC1[C@@H](\C=C\Cl)[C@H](C2)OC(=O)c1ccccc1
InChI Key InChIKey=SZEMKJNZWPMHNH-LOLGDRDZSA-N
Data  1 IC50
  Tab Delimited (TSV)   2D SDfile   Computed 3D by Vconf -m prep SDfile
Find this compound or compounds like it in BindingDB:
Activity Spreadsheet -- Enzyme Inhibition Constant Data from BindingDB
Found 1 hit for monomerid = 50004170
TargetSodium-dependent dopamine transporter(Rattus norvegicus (rat))
Mayo Foundation
Curated by ChEMBL
LigandPNGBDBM50004170(Benzoic acid 2-(2-chloro-vinyl)-8-methyl-8-aza-bic...)
Affinity DataIC50:  222nM. Assay description: Compound was evaluated for its ability to displace [3H]mazindol binding from rat striatal membranes
In DepthDetails ArticlePubMed