BDBM50004261 CHEMBL3237500
SMILES NS(=O)(=O)c1cccc(NC(=S)NC(=O)c2cc3ccccc3oc2=O)c1
InChI Key InChIKey=OVKWYKQJPMYNJW-UHFFFAOYSA-N
Data  1 IC50
  Tab Delimited (TSV)   2D SDfile   Computed 3D by Vconf -m prep SDfile
Find this compound or compounds like it in BindingDB:
Activity Spreadsheet -- Enzyme Inhibition Constant Data from BindingDB
Found 1 hit for monomerid = 50004261
TargetCarbonic anhydrase 2(Bos taurus)
Comsats Institute Of Information Technology
Curated by ChEMBL
LigandPNGBDBM50004261(CHEMBL3237500)
Affinity DataIC50:  1.34E+4nM. Assay description: Inhibition of bovine erythrocyte carbonic anhydrase 2 using p-nitrophenyl acetate as substrate preincubated for 10 mins before substrate addition mea...
In DepthDetails ArticlePubMed