BDBM50004314 CHEMBL3237537
SMILES CCOc1ccc(Cc2nn3c(nnc3s2)-c2ccncc2)cc1
InChI Key InChIKey=RVIOSYAOITZWNI-UHFFFAOYSA-N
Data  3 IC50
  Tab Delimited (TSV)   2D SDfile   Computed 3D by Vconf -m prep SDfile
Find this compound or compounds like it in BindingDB:
Activity Spreadsheet -- Enzyme Inhibition Constant Data from BindingDB
Found 3 hits for monomerid = 50004314
TargetIntestinal-type alkaline phosphatase(Bos taurus (Cattle))
Quaid-I-Azam University
Curated by ChEMBL
LigandPNGBDBM50004314(CHEMBL3237537)
Affinity DataIC50:  6.17E+3nM. Assay description: Inhibition of calf intestinal alkaline phosphatase using p-nitrophenyl phosphate as substrate preincubated for 10 mins before substrate addition afte...
In DepthDetails ArticlePubMed
TargetCholinesterase(Homo sapiens (Human))
Quaid-I-Azam University
Curated by ChEMBL
LigandPNGBDBM50004314(CHEMBL3237537)
Affinity DataIC50:  3.21E+4nM. Assay description: Inhibition of human BChE using butyrylthiocholine iodide as substrate preincubated for 10 mins before substrate addition after 15 mins by Ellman's me...
In DepthDetails ArticlePubMed
TargetAcetylcholinesterase(Electrophorus electricus (Electric eel))
Quaid-I-Azam University
Curated by ChEMBL
LigandPNGBDBM50004314(CHEMBL3237537)
Affinity DataIC50:  3.48E+3nM. Assay description: Inhibition of electric eel acetylcholinesterase using acetylthiocholine iodide as substrate preincubated for 10 mins before substrate addition after ...
In DepthDetails ArticlePubMed