BDBM50004391 2-{4-[(4-Methoxy-2-methyl-quinolin-6-ylmethyl)-prop-2-ynyl-amino]-benzoylamino}-pentanedioic acid ; hydrate::CHEMBL92944
SMILES COc1cc(C)nc2ccc(CN(CC#C)c3ccc(cc3)C(=O)N[C@@H](CCC(O)=O)C(O)=O)cc12
InChI Key InChIKey=MSCWBOSYPSZDME-QHCPKHFHSA-N
Data  1 IC50
  Tab Delimited (TSV)   2D SDfile   Computed 3D by Vconf -m prep SDfile
Find this compound or compounds like it in BindingDB:
Activity Spreadsheet -- Enzyme Inhibition Constant Data from BindingDB
Found 1 hit for monomerid = 50004391
TargetThymidylate synthase(Mus musculus)
Ici Pharmaceuticals Group
Curated by ChEMBL
LigandPNGBDBM50004391(2-{4-[(4-Methoxy-2-methyl-quinolin-6-ylmethyl)-pro...)
Affinity DataIC50:  6.00E+3nM. Assay description: In vitro inhibitory activity against thymidylate synthase from L1210 mouse leukemia cells
In DepthDetails ArticlePubMed