BDBM50004447 CHEMBL3238212
SMILES [O-][N+](=O)c1cc(cc(c1)[N+]([O-])=O)C(=O)Oc1ccc(cc1)-c1ccccc1
InChI Key InChIKey=XETLONOKCAMDQB-UHFFFAOYSA-N
Data  2 IC50
  Tab Delimited (TSV)   2D SDfile   Computed 3D by Vconf -m prep SDfile
Find this compound or compounds like it in BindingDB:
Activity Spreadsheet -- Enzyme Inhibition Constant Data from BindingDB
Found 2 hits for monomerid = 50004447
TargetPolyunsaturated fatty acid 5-lipoxygenase(Homo sapiens (Human))
Peking University
Curated by ChEMBL
LigandPNGBDBM50004447(CHEMBL3238212)
Affinity DataIC50: >5.00E+4nM. Assay description: Inhibition of human 5-LOX using arachidonic acid as substrate preincubated for 10 mins followed by substrate addition by H2DCFDA staining-based fluor...
In DepthDetails ArticlePubMed
TargetPolyunsaturated fatty acid 5-lipoxygenase(Homo sapiens (Human))
Peking University
Curated by ChEMBL
LigandPNGBDBM50004447(CHEMBL3238212)
Affinity DataIC50: >5.00E+4nM. Assay description: Inhibition of 5-LOX in human whole blood assessed as inhibition of A23187-induced LTB4 production preincubated for 15 mins followed by A23187 inducti...
In DepthDetails ArticlePubMed